BDBM50429593 CHEMBL2334196
SMILES CC(=O)OC[C@]1(C)[C@H](CC[C@@]2(C)[C@H]1C[C@H](OC(=O)c1cccc(C)c1)[C@@]1(C)Oc3cc(oc(=O)c3[C@H](O)[C@H]21)-c1cccnc1)OC(C)=O
InChI Key InChIKey=IMLFGOWNGHAQHV-ZRPSWOMSSA-N
Data  2 IC50
  Tab Delimited (TSV)   2D SDfile   Computed 3D by Vconf -m prep SDfile
Find this compound or compounds like it in BindingDB:
Activity Spreadsheet -- Enzyme Inhibition Constant Data from BindingDB
Found 1 hit for monomerid = 50429593
TargetSterol O-acyltransferase 1(Homo sapiens (Human))
Kitasato University
Curated by ChEMBL
LigandPNGBDBM50429593(CHEMBL2334196)
Affinity DataIC50:  650nM. Assay description: Inhibition of ACAT1 (unknown origin) expressed in CHO cells
In DepthDetails ArticlePubMed